{"text_format":"1","workbook":"xlsx","n_sheets":5,"sheets":["menu","6列前向き","6列7人","7列前向き","7列7人"],"not_rendered":{"charts":0,"images":29,"macros":1,"external_links":0,"defined_names":4,"comments":0,"pivot_tables":0},"unopened":[],"bounds":{"document_bytes":16777216,"sheet_cells":100000,"rows_first":2000,"rows_last":500,"rows_between":2000,"halvings":0,"cell_chars":16384,"cell_head_chars":4096},"cells_cut":0,"cells_raw":0,"read":"whole","date_system":"1900"}

{"sheet":"menu","index":0,"n_rows":19,"n_cols":5,"rows_kept":19,"cut":false,"hidden":false,"merged":[[16,4,16,11],[18,4,18,11]]}
[]
[]
[]
[]
[]
[]
[]
[]
[]
[]
[]
[]
[]
[]
[]
[]
[null,null,null,null,"印刷はA4用紙です、その他の用紙は手作業で。"]
[]
[null,null,null,null,"自作したいときはyotubuを見てください。"]

{"sheet":"6列前向き","index":1,"n_rows":63,"n_cols":19,"rows_kept":63,"cut":false,"hidden":false,"merged":[[15,8,25,8],[61,3,61,12],[62,3,62,12]]}
[1,2,3,4,5,6,7,8,9,10,11,12,13,14,15,16,17,18,19]
[null,null,null,null,null,null,null,null,null,null,null,"6列7行ヴァージョン"]
[null,null,null,null,null,null,null,null,"クラス人数",null,null,36,29,22,null,15,8,1]
[null,null,null,null,null,null,null,null,42]
[null,null,null,null,null,null,null,null,null,null,null,null,null,null,null,null,null,{"$f":"NOW()","v":"2021-05-07T11:29:38.600"}]
["No","名前","性別","クラス係","部活","結合","座席番号"]
[1,"アイデン","男","委員長","バドミントン",{"$f":"IF($B7<>\"\",$A$6&$A7&\".\"&$B7&CHAR(10)&$D7&CHAR(10)&$E7,\"\")","v":"No1.アイデン\n委員長\nバドミントン"},1]
[2,"アウグストゥス","女",null,null,{"$f":"IF($B8<>\"\",$A$6&$A8&\".\"&$B8&CHAR(10)&$D8&CHAR(10)&$E8,\"\")","v":"No2.アウグストゥス\n\n"},2]
[3,"アグスティン","女",null,null,"No3.アグスティン\n\n",3]
[4,"アクセル","男",null,null,"No4.アクセル\n\n",4]
[5,"アシュトン",null,null,null,"No5.アシュトン\n\n",5]
[6,"アダマン","女","書記",null,"No6.アダマン\n書記\n",6,null,null,null,1]
[7,"アダム",null,null,null,"No7.アダム\n\n",7]
[8,"アッシャー","男",null,null,"No8.アッシャー\n\n",8]
[9,"アディソン","男",null,null,"No9.アディソン\n\n",9]
[10,"アデン",null,null,null,"No10.アデン\n\n",10,null,"・座席番号は右から縦に割り振ってある\n・人数が42人未満の時は使用しない席の番号を省く。例）生徒数が40人で1、36番を使用しないときは座席番号に1,36を除いた42番までの数値を入力する。"]
[11,"アドニス","女",null,null,"No11.アドニス\n\n",11]
[12,"アドリアン","女",null,null,"No12.アドリアン\n\n",12]
[13,"アドルフォ","男",null,null,"No13.アドルフォ\n\n",13,null,null,null,2]
[14,"アブドラ","女",null,null,"No14.アブドラ\n\n",14]
[15,"アブラハム",null,null,null,"No15.アブラハム\n\n",15]
[16,"アブラム",null,null,null,"No16.アブラム\n\n",16]
[17,"アベル",null,null,null,"No17.アベル\n\n",17]
[18,"アマリ",null,null,null,"No18.アマリ\n\n",18]
[19,"アミール",null,null,null,"No19.アミール\n\n",19,null,null,null,3]
[20,"アモス","男",null,null,"No20.アモス\n\n",20]
[21,"アラン",null,null,null,"No21.アラン\n\n",21]
[22,"アラン","男",null,null,"No22.アラン\n\n",22]
[23,"アリ",null,null,null,"No23.アリ\n\n",23]
[24,"アリ",null,null,null,"No24.アリ\n\n",24]
[25,"アリエル",null,null,null,"No25.アリエル\n\n",25]
[26,"エドウィン",null,null,null,"No26.エドウィン\n\n",26,null,null,null,4]
[27,"エドガー",null,null,null,"No27.エドガー\n\n",27]
[28,"エドワード",null,null,null,"No28.エドワード\n\n",28]
[29,"エフレイン",null,null,null,"No29.エフレイン\n\n",29]
[30,"エフレイン",null,null,null,"No30.エフレイン\n\n",30]
[31,"エマーソン","男",null,null,"No31.エマーソン\n\n",31]
[32,"エマニュエル",null,null,null,"No32.エマニュエル\n\n",32]
[33,"エマニュエル",null,null,null,"No33.エマニュエル\n\n",33,null,null,null,5]
[34,"アドルフォ",null,null,null,"No34.アドルフォ\n\n",34]
[35,"アブドラ",null,null,null,"No35.アブドラ\n\n",35]
[36,"アブラハム",null,null,null,"No36.アブラハム\n\n",36]
[37,"アブラム",null,null,null,"No37.アブラム\n\n",37]
[38,"アベル",null,null,null,"No38.アベル\n\n",38]
[39,"アマリ",null,null,null,"No39.アマリ\n\n",39]
[40,"アミール",null,null,null,"No40.アミール\n\n",40,null,null,null,6]
[41,"アモス",null,null,null,"No41.アモス\n\n",41]
[42,"アラン",null,null,null,{"$f":"IF($B48<>\"\",$A$6&$A48&\".\"&$B48&CHAR(10)&$D48&CHAR(10)&$E48)","v":"No42.アラン\n\n"},42]
[]
[]
[]
[null,null,null,null,null,null,null,null,null,null,7]
[]
[]
[null,null,null,null,null,null,null,null,null,null,null,36,29,22,null,15,8,1]
[null,null,null,null,null,null,null,null,null,null,null,42,35,28,null,21,14,7]
[]
[]
[]
[]
[]
[null,null,null,"あなたにとってこれが有益なならばアマゾンギフトでで100円寄付してもらえますか、mail address－－　  kts.kei.shima@outlook.com"]
[null,null,null,"https://www.amazon.co.jp/Amazon%E3%82%AE%E3%83%95%E3%83%88%E5%88%B8-E%E3%83%A1%E3%83%BC%E3%83%AB%E3%82%BF%E3%82%A4%E3%83%97/dp/BT00DHI8G4"]

{"sheet":"6列7人","index":2,"n_rows":56,"n_cols":18,"rows_kept":56,"cut":false,"hidden":false,"merged":[[15,8,25,8]]}
[]
[null,null,null,null,null,null,null,null,null,null,null,"6列7行ヴァージョン"]
[null,null,null,null,null,null,null,null,"クラス人数"]
[null,null,null,null,null,null,null,null,42]
[]
["No","名前","性別","クラス係","部活","結合","座席番号",null,null,null,null,null,null,null,null,null,null,{"$f":"NOW()","v":"2021-05-07T11:29:38.600"}]
[1,{"$f":"IF('6列前向き'!B7<>\"\",'6列前向き'!B7,\"\")","v":"アイデン"},{"$f":"IF('6列前向き'!C7<>\"\",'6列前向き'!C7,\"\")","v":"男"},{"$f":"IF('6列前向き'!D7<>\"\",'6列前向き'!D7,\"\")","v":"委員長"},"バドミントン",{"$f":"IF($B7<>\"\",$A$6&$A7&\".\"&$B7&CHAR(10)&$D7&CHAR(10)&$E7,\"\")","v":"No1.アイデン\n委員長\nバドミントン"},42]
[2,{"$f":"IF('6列前向き'!B8<>\"\",'6列前向き'!B8,\"\")","v":"アウグストゥス"},{"$f":"IF('6列前向き'!C8<>\"\",'6列前向き'!C8,\"\")","v":"女"},{"$f":"IF('6列前向き'!D8<>\"\",'6列前向き'!D8,\"\")","v":""},{"$f":"IF('6列前向き'!E8<>\"\",'6列前向き'!E8,\"\")","v":""},{"$f":"IF($B8<>\"\",$A$6&$A8&\".\"&$B8&CHAR(10)&$D8&CHAR(10)&$E8,\"\")","v":"No2.アウグストゥス\n\n"},2]
[3,{"$f":"IF('6列前向き'!B9<>\"\",'6列前向き'!B9,\"\")","v":"アグスティン"},{"$f":"IF('6列前向き'!C9<>\"\",'6列前向き'!C9,\"\")","v":"女"},{"$f":"IF('6列前向き'!D9<>\"\",'6列前向き'!D9,\"\")","v":""},{"$f":"IF('6列前向き'!E9<>\"\",'6列前向き'!E9,\"\")","v":""},"No3.アグスティン\n\n",3]
[4,{"$f":"IF('6列前向き'!B10<>\"\",'6列前向き'!B10,\"\")","v":"アクセル"},{"$f":"IF('6列前向き'!C10<>\"\",'6列前向き'!C10,\"\")","v":"男"},{"$f":"IF('6列前向き'!D10<>\"\",'6列前向き'!D10,\"\")","v":""},{"$f":"IF('6列前向き'!E10<>\"\",'6列前向き'!E10,\"\")","v":""},"No4.アクセル\n\n",4]
[5,{"$f":"IF('6列前向き'!B11<>\"\",'6列前向き'!B11,\"\")","v":"アシュトン"},{"$f":"IF('6列前向き'!C11<>\"\",'6列前向き'!C11,\"\")","v":""},{"$f":"IF('6列前向き'!D11<>\"\",'6列前向き'!D11,\"\")","v":""},{"$f":"IF('6列前向き'!E11<>\"\",'6列前向き'!E11,\"\")","v":""},"No5.アシュトン\n\n",5]
[6,{"$f":"IF('6列前向き'!B12<>\"\",'6列前向き'!B12,\"\")","v":"アダマン"},{"$f":"IF('6列前向き'!C12<>\"\",'6列前向き'!C12,\"\")","v":"女"},{"$f":"IF('6列前向き'!D12<>\"\",'6列前向き'!D12,\"\")","v":"書記"},{"$f":"IF('6列前向き'!E12<>\"\",'6列前向き'!E12,\"\")","v":""},"No6.アダマン\n書記\n",7,null,null,null,1]
[7,{"$f":"IF('6列前向き'!B13<>\"\",'6列前向き'!B13,\"\")","v":"アダム"},{"$f":"IF('6列前向き'!C13<>\"\",'6列前向き'!C13,\"\")","v":""},{"$f":"IF('6列前向き'!D13<>\"\",'6列前向き'!D13,\"\")","v":""},{"$f":"IF('6列前向き'!E13<>\"\",'6列前向き'!E13,\"\")","v":""},"No7.アダム\n\n",6]
[8,{"$f":"IF('6列前向き'!B14<>\"\",'6列前向き'!B14,\"\")","v":"アッシャー"},{"$f":"IF('6列前向き'!C14<>\"\",'6列前向き'!C14,\"\")","v":"男"},{"$f":"IF('6列前向き'!D14<>\"\",'6列前向き'!D14,\"\")","v":""},{"$f":"IF('6列前向き'!E14<>\"\",'6列前向き'!E14,\"\")","v":""},"No8.アッシャー\n\n",8]
[9,{"$f":"IF('6列前向き'!B15<>\"\",'6列前向き'!B15,\"\")","v":"アディソン"},{"$f":"IF('6列前向き'!C15<>\"\",'6列前向き'!C15,\"\")","v":"男"},{"$f":"IF('6列前向き'!D15<>\"\",'6列前向き'!D15,\"\")","v":""},{"$f":"IF('6列前向き'!E15<>\"\",'6列前向き'!E15,\"\")","v":""},"No9.アディソン\n\n",9]
[10,{"$f":"IF('6列前向き'!B16<>\"\",'6列前向き'!B16,\"\")","v":"アデン"},{"$f":"IF('6列前向き'!C16<>\"\",'6列前向き'!C16,\"\")","v":""},{"$f":"IF('6列前向き'!D16<>\"\",'6列前向き'!D16,\"\")","v":""},{"$f":"IF('6列前向き'!E16<>\"\",'6列前向き'!E16,\"\")","v":""},"No10.アデン\n\n",10,null,"・座席番号は右から縦に割り振ってある\n・人数が42人未満の時は使用しない席の番号を省く。例）生徒数が40人で1、36番を使用しないときは座席番号に1,36を除いた42番までの数値を入力する。"]
[11,{"$f":"IF('6列前向き'!B17<>\"\",'6列前向き'!B17,\"\")","v":"アドニス"},{"$f":"IF('6列前向き'!C17<>\"\",'6列前向き'!C17,\"\")","v":"女"},{"$f":"IF('6列前向き'!D17<>\"\",'6列前向き'!D17,\"\")","v":""},{"$f":"IF('6列前向き'!E17<>\"\",'6列前向き'!E17,\"\")","v":""},"No11.アドニス\n\n",11]
[12,{"$f":"IF('6列前向き'!B18<>\"\",'6列前向き'!B18,\"\")","v":"アドリアン"},{"$f":"IF('6列前向き'!C18<>\"\",'6列前向き'!C18,\"\")","v":"女"},{"$f":"IF('6列前向き'!D18<>\"\",'6列前向き'!D18,\"\")","v":""},{"$f":"IF('6列前向き'!E18<>\"\",'6列前向き'!E18,\"\")","v":""},"No12.アドリアン\n\n",12]
[13,{"$f":"IF('6列前向き'!B19<>\"\",'6列前向き'!B19,\"\")","v":"アドルフォ"},{"$f":"IF('6列前向き'!C19<>\"\",'6列前向き'!C19,\"\")","v":"男"},{"$f":"IF('6列前向き'!D19<>\"\",'6列前向き'!D19,\"\")","v":""},{"$f":"IF('6列前向き'!E19<>\"\",'6列前向き'!E19,\"\")","v":""},"No13.アドルフォ\n\n",13,null,null,null,2]
[14,{"$f":"IF('6列前向き'!B20<>\"\",'6列前向き'!B20,\"\")","v":"アブドラ"},{"$f":"IF('6列前向き'!C20<>\"\",'6列前向き'!C20,\"\")","v":"女"},{"$f":"IF('6列前向き'!D20<>\"\",'6列前向き'!D20,\"\")","v":""},{"$f":"IF('6列前向き'!E20<>\"\",'6列前向き'!E20,\"\")","v":""},"No14.アブドラ\n\n",14]
[15,{"$f":"IF('6列前向き'!B21<>\"\",'6列前向き'!B21,\"\")","v":"アブラハム"},{"$f":"IF('6列前向き'!C21<>\"\",'6列前向き'!C21,\"\")","v":""},{"$f":"IF('6列前向き'!D21<>\"\",'6列前向き'!D21,\"\")","v":""},{"$f":"IF('6列前向き'!E21<>\"\",'6列前向き'!E21,\"\")","v":""},"No15.アブラハム\n\n",15]
[16,{"$f":"IF('6列前向き'!B22<>\"\",'6列前向き'!B22,\"\")","v":"アブラム"},{"$f":"IF('6列前向き'!C22<>\"\",'6列前向き'!C22,\"\")","v":""},{"$f":"IF('6列前向き'!D22<>\"\",'6列前向き'!D22,\"\")","v":""},{"$f":"IF('6列前向き'!E22<>\"\",'6列前向き'!E22,\"\")","v":""},"No16.アブラム\n\n",16]
[17,{"$f":"IF('6列前向き'!B23<>\"\",'6列前向き'!B23,\"\")","v":"アベル"},{"$f":"IF('6列前向き'!C23<>\"\",'6列前向き'!C23,\"\")","v":""},{"$f":"IF('6列前向き'!D23<>\"\",'6列前向き'!D23,\"\")","v":""},{"$f":"IF('6列前向き'!E23<>\"\",'6列前向き'!E23,\"\")","v":""},"No17.アベル\n\n",17]
[18,{"$f":"IF('6列前向き'!B24<>\"\",'6列前向き'!B24,\"\")","v":"アマリ"},{"$f":"IF('6列前向き'!C24<>\"\",'6列前向き'!C24,\"\")","v":""},{"$f":"IF('6列前向き'!D24<>\"\",'6列前向き'!D24,\"\")","v":""},{"$f":"IF('6列前向き'!E24<>\"\",'6列前向き'!E24,\"\")","v":""},"No18.アマリ\n\n",18]
[19,{"$f":"IF('6列前向き'!B25<>\"\",'6列前向き'!B25,\"\")","v":"アミール"},{"$f":"IF('6列前向き'!C25<>\"\",'6列前向き'!C25,\"\")","v":""},{"$f":"IF('6列前向き'!D25<>\"\",'6列前向き'!D25,\"\")","v":""},{"$f":"IF('6列前向き'!E25<>\"\",'6列前向き'!E25,\"\")","v":""},"No19.アミール\n\n",19,null,null,null,3]
[20,{"$f":"IF('6列前向き'!B26<>\"\",'6列前向き'!B26,\"\")","v":"アモス"},{"$f":"IF('6列前向き'!C26<>\"\",'6列前向き'!C26,\"\")","v":"男"},{"$f":"IF('6列前向き'!D26<>\"\",'6列前向き'!D26,\"\")","v":""},{"$f":"IF('6列前向き'!E26<>\"\",'6列前向き'!E26,\"\")","v":""},"No20.アモス\n\n",20]
[21,{"$f":"IF('6列前向き'!B27<>\"\",'6列前向き'!B27,\"\")","v":"アラン"},{"$f":"IF('6列前向き'!C27<>\"\",'6列前向き'!C27,\"\")","v":""},{"$f":"IF('6列前向き'!D27<>\"\",'6列前向き'!D27,\"\")","v":""},{"$f":"IF('6列前向き'!E27<>\"\",'6列前向き'!E27,\"\")","v":""},"No21.アラン\n\n",21]
[22,{"$f":"IF('6列前向き'!B28<>\"\",'6列前向き'!B28,\"\")","v":"アラン"},{"$f":"IF('6列前向き'!C28<>\"\",'6列前向き'!C28,\"\")","v":"男"},{"$f":"IF('6列前向き'!D28<>\"\",'6列前向き'!D28,\"\")","v":""},{"$f":"IF('6列前向き'!E28<>\"\",'6列前向き'!E28,\"\")","v":""},"No22.アラン\n\n",22]
[23,{"$f":"IF('6列前向き'!B29<>\"\",'6列前向き'!B29,\"\")","v":"アリ"},{"$f":"IF('6列前向き'!C29<>\"\",'6列前向き'!C29,\"\")","v":""},{"$f":"IF('6列前向き'!D29<>\"\",'6列前向き'!D29,\"\")","v":""},{"$f":"IF('6列前向き'!E29<>\"\",'6列前向き'!E29,\"\")","v":""},"No23.アリ\n\n",23]
[24,{"$f":"IF('6列前向き'!B30<>\"\",'6列前向き'!B30,\"\")","v":"アリ"},{"$f":"IF('6列前向き'!C30<>\"\",'6列前向き'!C30,\"\")","v":""},{"$f":"IF('6列前向き'!D30<>\"\",'6列前向き'!D30,\"\")","v":""},{"$f":"IF('6列前向き'!E30<>\"\",'6列前向き'!E30,\"\")","v":""},"No24.アリ\n\n",24]
[25,{"$f":"IF('6列前向き'!B31<>\"\",'6列前向き'!B31,\"\")","v":"アリエル"},{"$f":"IF('6列前向き'!C31<>\"\",'6列前向き'!C31,\"\")","v":""},{"$f":"IF('6列前向き'!D31<>\"\",'6列前向き'!D31,\"\")","v":""},{"$f":"IF('6列前向き'!E31<>\"\",'6列前向き'!E31,\"\")","v":""},"No25.アリエル\n\n",25]
[26,{"$f":"IF('6列前向き'!B32<>\"\",'6列前向き'!B32,\"\")","v":"エドウィン"},{"$f":"IF('6列前向き'!C32<>\"\",'6列前向き'!C32,\"\")","v":""},{"$f":"IF('6列前向き'!D32<>\"\",'6列前向き'!D32,\"\")","v":""},{"$f":"IF('6列前向き'!E32<>\"\",'6列前向き'!E32,\"\")","v":""},"No26.エドウィン\n\n",26,null,null,null,4]
[27,{"$f":"IF('6列前向き'!B33<>\"\",'6列前向き'!B33,\"\")","v":"エドガー"},{"$f":"IF('6列前向き'!C33<>\"\",'6列前向き'!C33,\"\")","v":""},{"$f":"IF('6列前向き'!D33<>\"\",'6列前向き'!D33,\"\")","v":""},{"$f":"IF('6列前向き'!E33<>\"\",'6列前向き'!E33,\"\")","v":""},"No27.エドガー\n\n",27]
[28,{"$f":"IF('6列前向き'!B34<>\"\",'6列前向き'!B34,\"\")","v":"エドワード"},{"$f":"IF('6列前向き'!C34<>\"\",'6列前向き'!C34,\"\")","v":""},{"$f":"IF('6列前向き'!D34<>\"\",'6列前向き'!D34,\"\")","v":""},"　","No28.エドワード\n\n　",28]
[29,{"$f":"IF('6列前向き'!B35<>\"\",'6列前向き'!B35,\"\")","v":"エフレイン"},{"$f":"IF('6列前向き'!C35<>\"\",'6列前向き'!C35,\"\")","v":""},{"$f":"IF('6列前向き'!D35<>\"\",'6列前向き'!D35,\"\")","v":""},{"$f":"IF('6列前向き'!E35<>\"\",'6列前向き'!E35,\"\")","v":""},"No29.エフレイン\n\n",29]
[30,{"$f":"IF('6列前向き'!B36<>\"\",'6列前向き'!B36,\"\")","v":"エフレイン"},{"$f":"IF('6列前向き'!C36<>\"\",'6列前向き'!C36,\"\")","v":""},{"$f":"IF('6列前向き'!D36<>\"\",'6列前向き'!D36,\"\")","v":""},{"$f":"IF('6列前向き'!E36<>\"\",'6列前向き'!E36,\"\")","v":""},"No30.エフレイン\n\n",30]
[31,{"$f":"IF('6列前向き'!B37<>\"\",'6列前向き'!B37,\"\")","v":"エマーソン"},{"$f":"IF('6列前向き'!C37<>\"\",'6列前向き'!C37,\"\")","v":"男"},{"$f":"IF('6列前向き'!D37<>\"\",'6列前向き'!D37,\"\")","v":""},{"$f":"IF('6列前向き'!E37<>\"\",'6列前向き'!E37,\"\")","v":""},"No31.エマーソン\n\n",31]
[32,{"$f":"IF('6列前向き'!B38<>\"\",'6列前向き'!B38,\"\")","v":"エマニュエル"},{"$f":"IF('6列前向き'!C38<>\"\",'6列前向き'!C38,\"\")","v":""},{"$f":"IF('6列前向き'!D38<>\"\",'6列前向き'!D38,\"\")","v":""},{"$f":"IF('6列前向き'!E38<>\"\",'6列前向き'!E38,\"\")","v":""},"No32.エマニュエル\n\n",32]
[33,{"$f":"IF('6列前向き'!B39<>\"\",'6列前向き'!B39,\"\")","v":"エマニュエル"},{"$f":"IF('6列前向き'!C39<>\"\",'6列前向き'!C39,\"\")","v":""},{"$f":"IF('6列前向き'!D39<>\"\",'6列前向き'!D39,\"\")","v":""},{"$f":"IF('6列前向き'!E39<>\"\",'6列前向き'!E39,\"\")","v":""},"No33.エマニュエル\n\n",33,null,null,null,5]
[34,{"$f":"IF('6列前向き'!B40<>\"\",'6列前向き'!B40,\"\")","v":"アドルフォ"},{"$f":"IF('6列前向き'!C40<>\"\",'6列前向き'!C40,\"\")","v":""},{"$f":"IF('6列前向き'!D40<>\"\",'6列前向き'!D40,\"\")","v":""},{"$f":"IF('6列前向き'!E40<>\"\",'6列前向き'!E40,\"\")","v":""},"No34.アドルフォ\n\n",34]
[35,{"$f":"IF('6列前向き'!B41<>\"\",'6列前向き'!B41,\"\")","v":"アブドラ"},{"$f":"IF('6列前向き'!C41<>\"\",'6列前向き'!C41,\"\")","v":""},{"$f":"IF('6列前向き'!D41<>\"\",'6列前向き'!D41,\"\")","v":""},{"$f":"IF('6列前向き'!E41<>\"\",'6列前向き'!E41,\"\")","v":""},"No35.アブドラ\n\n",35]
[36,{"$f":"IF('6列前向き'!B42<>\"\",'6列前向き'!B42,\"\")","v":"アブラハム"},{"$f":"IF('6列前向き'!C42<>\"\",'6列前向き'!C42,\"\")","v":""},{"$f":"IF('6列前向き'!D42<>\"\",'6列前向き'!D42,\"\")","v":""},{"$f":"IF('6列前向き'!E42<>\"\",'6列前向き'!E42,\"\")","v":""},"No36.アブラハム\n\n",36]
[37,{"$f":"IF('6列前向き'!B43<>\"\",'6列前向き'!B43,\"\")","v":"アブラム"},{"$f":"IF('6列前向き'!C43<>\"\",'6列前向き'!C43,\"\")","v":""},{"$f":"IF('6列前向き'!D43<>\"\",'6列前向き'!D43,\"\")","v":""},{"$f":"IF('6列前向き'!E43<>\"\",'6列前向き'!E43,\"\")","v":""},"No37.アブラム\n\n",37]
[38,{"$f":"IF('6列前向き'!B44<>\"\",'6列前向き'!B44,\"\")","v":"アベル"},{"$f":"IF('6列前向き'!C44<>\"\",'6列前向き'!C44,\"\")","v":""},{"$f":"IF('6列前向き'!D44<>\"\",'6列前向き'!D44,\"\")","v":""},{"$f":"IF('6列前向き'!E44<>\"\",'6列前向き'!E44,\"\")","v":""},"No38.アベル\n\n",38]
[39,{"$f":"IF('6列前向き'!B45<>\"\",'6列前向き'!B45,\"\")","v":"アマリ"},{"$f":"IF('6列前向き'!C45<>\"\",'6列前向き'!C45,\"\")","v":""},{"$f":"IF('6列前向き'!D45<>\"\",'6列前向き'!D45,\"\")","v":""},{"$f":"IF('6列前向き'!E45<>\"\",'6列前向き'!E45,\"\")","v":""},"No39.アマリ\n\n",39]
[40,{"$f":"IF('6列前向き'!B46<>\"\",'6列前向き'!B46,\"\")","v":"アミール"},{"$f":"IF('6列前向き'!C46<>\"\",'6列前向き'!C46,\"\")","v":""},{"$f":"IF('6列前向き'!D46<>\"\",'6列前向き'!D46,\"\")","v":""},{"$f":"IF('6列前向き'!E46<>\"\",'6列前向き'!E46,\"\")","v":""},"No40.アミール\n\n",40,null,null,null,6]
[41,{"$f":"IF('6列前向き'!B47<>\"\",'6列前向き'!B47,\"\")","v":"アモス"},{"$f":"IF('6列前向き'!C47<>\"\",'6列前向き'!C47,\"\")","v":""},{"$f":"IF('6列前向き'!D47<>\"\",'6列前向き'!D47,\"\")","v":""},{"$f":"IF('6列前向き'!E47<>\"\",'6列前向き'!E47,\"\")","v":""},"No41.アモス\n\n",41]
[42,{"$f":"IF('6列前向き'!B48<>\"\",'6列前向き'!B48,\"\")","v":"アラン"},{"$f":"IF('6列前向き'!C48<>\"\",'6列前向き'!C48,\"\")","v":""},{"$f":"IF('6列前向き'!D48<>\"\",'6列前向き'!D48,\"\")","v":""},{"$f":"IF('6列前向き'!E48<>\"\",'6列前向き'!E48,\"\")","v":""},"No42.アラン\n\n",1]
[]
[]
[]
[null,null,null,null,null,null,null,null,null,null,7]
[]
[]
[null,null,null,null,null,null,null,null,null,null,null,36,29,22,null,15,8,1]
[null,null,null,null,null,null,null,null,null,null,null,42,35,28,null,21,14,7]

{"sheet":"7列前向き","index":3,"n_rows":56,"n_cols":18,"rows_kept":56,"cut":false,"hidden":false,"merged":[[15,8,25,8]]}
[1,2,3,4,5,6,7,8,9,10,11,12,13,14,15,16,17,18]
[null,null,null,null,null,null,null,null,null,null,null,"7列7行ヴァージョン"]
[null,null,null,null,null,null,null,null,"クラス人数"]
[null,null,null,null,null,null,null,null,49]
[]
["No","名前","性別","クラス係","部活","結合","座席番号",null,null,null,null,null,null,null,null,null,null,{"$f":"NOW()","v":"2021-05-07T11:29:38.600"}]
[1,"広瀬　敬一","男","体育委員","陸上",{"$f":"IF($B7<>\"\",$A7&\".\"&$B7&CHAR(10)&$D7&CHAR(10)&$E7,\"\")","v":"1.広瀬　敬一\n体育委員\n陸上"},1]
[2,"岩瀬　信夫","男",null,"水泳",{"$f":"IF($B8<>\"\",$A8&\".\"&$B8&CHAR(10)&$D8&CHAR(10)&$E8,\"\")","v":"2.岩瀬　信夫\n\n水泳"},2]
[3,"アーサー","男",null,null,"3.アーサー\n\n",3]
[4,"アーサック","女","副委員長","バスケット","4.アーサック\n副委員長\nバスケット",4,null,null,null,1]
[5,"アーネスト","男",null,null,"5.アーネスト\n\n",5]
[6,"アーノルド",null,null,null,"6.アーノルド\n\n",6]
[7,"アーバン",null,null,null,"7.アーバン\n\n",7]
[8,"アーマド",null,null,null,"8.アーマド\n\n",8]
[9,"アーメッド",null,null,null,"9.アーメッド\n\n",9,null,null,null,"z"]
[10,"アール",null,null,null,"10.アール\n\n",10,null,"・座席番号は右から縦に割り振ってある\n・人数が49未満の時は使用しない席の番号を省く。例）生徒数が47人で1、43番を使用しないときは座席番号に1,43を除いた49番までの数値を入力する。"]
[11,"アーロン",null,null,null,"11.アーロン\n\n",11]
[12,"アイザアス",null,null,null,"12.アイザアス\n\n",12,null,null,null,2]
[13,"アイザック",null,null,null,"13.アイザック\n\n",13]
[14,"アイザック",null,null,null,"14.アイザック\n\n",14]
[15,"アイデン",null,null,null,"15.アイデン\n\n",15]
[16,"アイデン",null,null,null,"16.アイデン\n\n",16]
[17,"アウグストゥス",null,null,null,"17.アウグストゥス\n\n",17]
[18,"アグスティン",null,null,null,"18.アグスティン\n\n",18]
[19,"アクセル",null,null,null,"19.アクセル\n\n",19,null,null,null,3]
[20,"アシュトン",null,null,null,"20.アシュトン\n\n",20]
[21,"アダマン",null,null,null,"21.アダマン\n\n",21]
[22,"アダム",null,null,null,"22.アダム\n\n",22]
[23,"アッシャー",null,null,null,"23.アッシャー\n\n",23]
[24,"アディソン",null,null,null,"24.アディソン\n\n",24]
[25,"アデン",null,null,null,"25.アデン\n\n",25]
[26,"アドニス",null,null,null,"26.アドニス\n\n",26,null,null,null,4]
[27,"アドリアン",null,null,null,"27.アドリアン\n\n",27]
[28,"アドルフォ",null,null,null,"28.アドルフォ\n\n",28]
[29,"アブドラ",null,null,null,"29.アブドラ\n\n",29]
[30,"アブラハム",null,null,null,"30.アブラハム\n\n",30]
[31,"アブラム",null,null,null,"31.アブラム\n\n",31]
[32,"アベル",null,null,null,"32.アベル\n\n",32,null,null,null,5]
[33,"アマリ",null,null,null,"33.アマリ\n\n",33]
[34,"アミール",null,null,null,"34.アミール\n\n",34]
[35,"アモス",null,null,null,"35.アモス\n\n",35]
[36,"アラン",null,null,null,"36.アラン\n\n",36]
[37,"アラン",null,null,null,"37.アラン\n\n",37]
[38,"アリ",null,null,null,"38.アリ\n\n",38]
[39,"アリ",null,null,null,"39.アリ\n\n",39,null,null,null,6]
[40,"アリエル",null,null,null,"40.アリエル\n\n",40]
[41,"アルヴァロ",null,null,null,"41.アルヴァロ\n\n",41]
[42,"アルヴィン",null,null,null,"42.アルヴィン\n\n",42]
[43,"アルデン",null,null,null,"43.アルデン\n\n",43]
[44,"アルド",null,null,null,"44.アルド\n\n",44]
[45,"アルトゥーロ",null,null,null,"45.アルトゥーロ\n\n",45]
[46,"アルバート",null,null,null,"46.アルバート\n\n",46,null,null,null,7]
[47,"ジャック","男",null,null,"47.ジャック\n\n",47]
[48,"メルケル",null,null,null,"48.メルケル\n\n",48]
[49,"ジョンソン",null,null,null,"49.ジョンソン\n\n",49,null,null,null,null,43,36,28,22,15,8,1]
[null,null,null,null,null,null,null,null,null,null,null,49,42,35,27,21,14,7]

{"sheet":"7列7人","index":4,"n_rows":56,"n_cols":18,"rows_kept":56,"cut":false,"hidden":false,"merged":[[15,8,25,8]]}
[]
[null,null,null,null,null,null,null,null,null,null,null,"7列7行ヴァージョン"]
[null,null,null,null,null,null,null,null,"クラス人数"]
[null,null,null,null,null,null,null,null,49]
[]
["No","名前","性別","クラス係","部活","結合","座席番号",null,null,null,null,null,null,null,null,null,null,{"$f":"NOW()","v":"2021-05-07T11:29:38.600"}]
[1,{"$f":"IF('7列前向き'!B7<>\"\",'7列前向き'!B7,\"\")","v":"広瀬　敬一"},{"$f":"IF('7列前向き'!C7<>\"\",'7列前向き'!C7,\"\")","v":"男"},{"$f":"IF('7列前向き'!D7<>\"\",'7列前向き'!D7,\"\")","v":"体育委員"},{"$f":"IF('7列前向き'!E7<>\"\",'7列前向き'!E7,\"\")","v":"陸上"},{"$f":"IF($B7<>\"\",$A7&\".\"&$B7&CHAR(10)&$D7&CHAR(10)&$E7,\"\")","v":"1.広瀬　敬一\n体育委員\n陸上"},1]
[2,{"$f":"IF('7列前向き'!B8<>\"\",'7列前向き'!B8,\"\")","v":"岩瀬　信夫"},{"$f":"IF('7列前向き'!C8<>\"\",'7列前向き'!C8,\"\")","v":"男"},{"$f":"IF('7列前向き'!D8<>\"\",'7列前向き'!D8,\"\")","v":""},{"$f":"IF('7列前向き'!E8<>\"\",'7列前向き'!E8,\"\")","v":"水泳"},{"$f":"IF($B8<>\"\",$A8&\".\"&$B8&CHAR(10)&$D8&CHAR(10)&$E8,\"\")","v":"2.岩瀬　信夫\n\n水泳"},2]
[3,{"$f":"IF('7列前向き'!B9<>\"\",'7列前向き'!B9,\"\")","v":"アーサー"},{"$f":"IF('7列前向き'!C9<>\"\",'7列前向き'!C9,\"\")","v":"男"},{"$f":"IF('7列前向き'!D9<>\"\",'7列前向き'!D9,\"\")","v":""},{"$f":"IF('7列前向き'!E9<>\"\",'7列前向き'!E9,\"\")","v":""},"3.アーサー\n\n",3]
[4,{"$f":"IF('7列前向き'!B10<>\"\",'7列前向き'!B10,\"\")","v":"アーサック"},{"$f":"IF('7列前向き'!C10<>\"\",'7列前向き'!C10,\"\")","v":"女"},{"$f":"IF('7列前向き'!D10<>\"\",'7列前向き'!D10,\"\")","v":"副委員長"},{"$f":"IF('7列前向き'!E10<>\"\",'7列前向き'!E10,\"\")","v":"バスケット"},"4.アーサック\n副委員長\nバスケット",4,null,null,null,1]
[5,{"$f":"IF('7列前向き'!B11<>\"\",'7列前向き'!B11,\"\")","v":"アーネスト"},{"$f":"IF('7列前向き'!C11<>\"\",'7列前向き'!C11,\"\")","v":"男"},{"$f":"IF('7列前向き'!D11<>\"\",'7列前向き'!D11,\"\")","v":""},{"$f":"IF('7列前向き'!E11<>\"\",'7列前向き'!E11,\"\")","v":""},"5.アーネスト\n\n",5]
[6,{"$f":"IF('7列前向き'!B12<>\"\",'7列前向き'!B12,\"\")","v":"アーノルド"},{"$f":"IF('7列前向き'!C12<>\"\",'7列前向き'!C12,\"\")","v":""},{"$f":"IF('7列前向き'!D12<>\"\",'7列前向き'!D12,\"\")","v":""},{"$f":"IF('7列前向き'!E12<>\"\",'7列前向き'!E12,\"\")","v":""},"6.アーノルド\n\n",6]
[7,{"$f":"IF('7列前向き'!B13<>\"\",'7列前向き'!B13,\"\")","v":"アーバン"},{"$f":"IF('7列前向き'!C13<>\"\",'7列前向き'!C13,\"\")","v":""},{"$f":"IF('7列前向き'!D13<>\"\",'7列前向き'!D13,\"\")","v":""},{"$f":"IF('7列前向き'!E13<>\"\",'7列前向き'!E13,\"\")","v":""},"7.アーバン\n\n",7]
[8,{"$f":"IF('7列前向き'!B14<>\"\",'7列前向き'!B14,\"\")","v":"アーマド"},{"$f":"IF('7列前向き'!C14<>\"\",'7列前向き'!C14,\"\")","v":""},{"$f":"IF('7列前向き'!D14<>\"\",'7列前向き'!D14,\"\")","v":""},{"$f":"IF('7列前向き'!E14<>\"\",'7列前向き'!E14,\"\")","v":""},"8.アーマド\n\n",8]
[9,{"$f":"IF('7列前向き'!B15<>\"\",'7列前向き'!B15,\"\")","v":"アーメッド"},{"$f":"IF('7列前向き'!C15<>\"\",'7列前向き'!C15,\"\")","v":""},{"$f":"IF('7列前向き'!D15<>\"\",'7列前向き'!D15,\"\")","v":""},{"$f":"IF('7列前向き'!E15<>\"\",'7列前向き'!E15,\"\")","v":""},"9.アーメッド\n\n",9]
[10,{"$f":"IF('7列前向き'!B16<>\"\",'7列前向き'!B16,\"\")","v":"アール"},{"$f":"IF('7列前向き'!C16<>\"\",'7列前向き'!C16,\"\")","v":""},{"$f":"IF('7列前向き'!D16<>\"\",'7列前向き'!D16,\"\")","v":""},{"$f":"IF('7列前向き'!E16<>\"\",'7列前向き'!E16,\"\")","v":""},"10.アール\n\n",10,null,"・座席番号は右から縦に割り振ってある\n・人数が49未満の時は使用しない席の番号を省く。例）生徒数が47人で1、43番を使用しないときは座席番号に1,43を除いた49番までの数値を入力する。"]
[11,{"$f":"IF('7列前向き'!B17<>\"\",'7列前向き'!B17,\"\")","v":"アーロン"},{"$f":"IF('7列前向き'!C17<>\"\",'7列前向き'!C17,\"\")","v":""},{"$f":"IF('7列前向き'!D17<>\"\",'7列前向き'!D17,\"\")","v":""},{"$f":"IF('7列前向き'!E17<>\"\",'7列前向き'!E17,\"\")","v":""},"11.アーロン\n\n",11]
[12,{"$f":"IF('7列前向き'!B18<>\"\",'7列前向き'!B18,\"\")","v":"アイザアス"},{"$f":"IF('7列前向き'!C18<>\"\",'7列前向き'!C18,\"\")","v":""},{"$f":"IF('7列前向き'!D18<>\"\",'7列前向き'!D18,\"\")","v":""},{"$f":"IF('7列前向き'!E18<>\"\",'7列前向き'!E18,\"\")","v":""},"12.アイザアス\n\n",12,null,null,null,2]
[13,{"$f":"IF('7列前向き'!B19<>\"\",'7列前向き'!B19,\"\")","v":"アイザック"},{"$f":"IF('7列前向き'!C19<>\"\",'7列前向き'!C19,\"\")","v":""},{"$f":"IF('7列前向き'!D19<>\"\",'7列前向き'!D19,\"\")","v":""},{"$f":"IF('7列前向き'!E19<>\"\",'7列前向き'!E19,\"\")","v":""},"13.アイザック\n\n",13]
[14,{"$f":"IF('7列前向き'!B20<>\"\",'7列前向き'!B20,\"\")","v":"アイザック"},{"$f":"IF('7列前向き'!C20<>\"\",'7列前向き'!C20,\"\")","v":""},{"$f":"IF('7列前向き'!D20<>\"\",'7列前向き'!D20,\"\")","v":""},{"$f":"IF('7列前向き'!E20<>\"\",'7列前向き'!E20,\"\")","v":""},"14.アイザック\n\n",14]
[15,{"$f":"IF('7列前向き'!B21<>\"\",'7列前向き'!B21,\"\")","v":"アイデン"},{"$f":"IF('7列前向き'!C21<>\"\",'7列前向き'!C21,\"\")","v":""},{"$f":"IF('7列前向き'!D21<>\"\",'7列前向き'!D21,\"\")","v":""},{"$f":"IF('7列前向き'!E21<>\"\",'7列前向き'!E21,\"\")","v":""},"15.アイデン\n\n",15]
[16,{"$f":"IF('7列前向き'!B22<>\"\",'7列前向き'!B22,\"\")","v":"アイデン"},{"$f":"IF('7列前向き'!C22<>\"\",'7列前向き'!C22,\"\")","v":""},{"$f":"IF('7列前向き'!D22<>\"\",'7列前向き'!D22,\"\")","v":""},{"$f":"IF('7列前向き'!E22<>\"\",'7列前向き'!E22,\"\")","v":""},"16.アイデン\n\n",16]
[17,{"$f":"IF('7列前向き'!B23<>\"\",'7列前向き'!B23,\"\")","v":"アウグストゥス"},{"$f":"IF('7列前向き'!C23<>\"\",'7列前向き'!C23,\"\")","v":""},{"$f":"IF('7列前向き'!D23<>\"\",'7列前向き'!D23,\"\")","v":""},{"$f":"IF('7列前向き'!E23<>\"\",'7列前向き'!E23,\"\")","v":""},"17.アウグストゥス\n\n",17]
[18,{"$f":"IF('7列前向き'!B24<>\"\",'7列前向き'!B24,\"\")","v":"アグスティン"},{"$f":"IF('7列前向き'!C24<>\"\",'7列前向き'!C24,\"\")","v":""},{"$f":"IF('7列前向き'!D24<>\"\",'7列前向き'!D24,\"\")","v":""},{"$f":"IF('7列前向き'!E24<>\"\",'7列前向き'!E24,\"\")","v":""},"18.アグスティン\n\n",18]
[19,{"$f":"IF('7列前向き'!B25<>\"\",'7列前向き'!B25,\"\")","v":"アクセル"},{"$f":"IF('7列前向き'!C25<>\"\",'7列前向き'!C25,\"\")","v":""},{"$f":"IF('7列前向き'!D25<>\"\",'7列前向き'!D25,\"\")","v":""},{"$f":"IF('7列前向き'!E25<>\"\",'7列前向き'!E25,\"\")","v":""},"19.アクセル\n\n",19,null,null,null,3]
[20,{"$f":"IF('7列前向き'!B26<>\"\",'7列前向き'!B26,\"\")","v":"アシュトン"},{"$f":"IF('7列前向き'!C26<>\"\",'7列前向き'!C26,\"\")","v":""},{"$f":"IF('7列前向き'!D26<>\"\",'7列前向き'!D26,\"\")","v":""},{"$f":"IF('7列前向き'!E26<>\"\",'7列前向き'!E26,\"\")","v":""},"20.アシュトン\n\n",20]
[21,{"$f":"IF('7列前向き'!B27<>\"\",'7列前向き'!B27,\"\")","v":"アダマン"},"男",{"$f":"IF('7列前向き'!D27<>\"\",'7列前向き'!D27,\"\")","v":""},{"$f":"IF('7列前向き'!E27<>\"\",'7列前向き'!E27,\"\")","v":""},"21.アダマン\n\n",21]
[22,{"$f":"IF('7列前向き'!B28<>\"\",'7列前向き'!B28,\"\")","v":"アダム"},"男",{"$f":"IF('7列前向き'!D28<>\"\",'7列前向き'!D28,\"\")","v":""},{"$f":"IF('7列前向き'!E28<>\"\",'7列前向き'!E28,\"\")","v":""},"22.アダム\n\n",22]
[23,{"$f":"IF('7列前向き'!B29<>\"\",'7列前向き'!B29,\"\")","v":"アッシャー"},{"$f":"IF('7列前向き'!C29<>\"\",'7列前向き'!C29,\"\")","v":""},{"$f":"IF('7列前向き'!D29<>\"\",'7列前向き'!D29,\"\")","v":""},{"$f":"IF('7列前向き'!E29<>\"\",'7列前向き'!E29,\"\")","v":""},"23.アッシャー\n\n",23]
[24,{"$f":"IF('7列前向き'!B30<>\"\",'7列前向き'!B30,\"\")","v":"アディソン"},{"$f":"IF('7列前向き'!C30<>\"\",'7列前向き'!C30,\"\")","v":""},{"$f":"IF('7列前向き'!D30<>\"\",'7列前向き'!D30,\"\")","v":""},{"$f":"IF('7列前向き'!E30<>\"\",'7列前向き'!E30,\"\")","v":""},"24.アディソン\n\n",24]
[25,{"$f":"IF('7列前向き'!B31<>\"\",'7列前向き'!B31,\"\")","v":"アデン"},{"$f":"IF('7列前向き'!C31<>\"\",'7列前向き'!C31,\"\")","v":""},{"$f":"IF('7列前向き'!D31<>\"\",'7列前向き'!D31,\"\")","v":""},{"$f":"IF('7列前向き'!E31<>\"\",'7列前向き'!E31,\"\")","v":""},"25.アデン\n\n",25]
[26,{"$f":"IF('7列前向き'!B32<>\"\",'7列前向き'!B32,\"\")","v":"アドニス"},{"$f":"IF('7列前向き'!C32<>\"\",'7列前向き'!C32,\"\")","v":""},{"$f":"IF('7列前向き'!D32<>\"\",'7列前向き'!D32,\"\")","v":""},{"$f":"IF('7列前向き'!E32<>\"\",'7列前向き'!E32,\"\")","v":""},"26.アドニス\n\n",26,null,null,null,4]
[27,{"$f":"IF('7列前向き'!B33<>\"\",'7列前向き'!B33,\"\")","v":"アドリアン"},{"$f":"IF('7列前向き'!C33<>\"\",'7列前向き'!C33,\"\")","v":""},{"$f":"IF('7列前向き'!D33<>\"\",'7列前向き'!D33,\"\")","v":""},{"$f":"IF('7列前向き'!E33<>\"\",'7列前向き'!E33,\"\")","v":""},"27.アドリアン\n\n",27]
[28,{"$f":"IF('7列前向き'!B34<>\"\",'7列前向き'!B34,\"\")","v":"アドルフォ"},{"$f":"IF('7列前向き'!C34<>\"\",'7列前向き'!C34,\"\")","v":""},{"$f":"IF('7列前向き'!D34<>\"\",'7列前向き'!D34,\"\")","v":""},{"$f":"IF('7列前向き'!E34<>\"\",'7列前向き'!E34,\"\")","v":""},"28.アドルフォ\n\n",28]
[29,{"$f":"IF('7列前向き'!B35<>\"\",'7列前向き'!B35,\"\")","v":"アブドラ"},{"$f":"IF('7列前向き'!C35<>\"\",'7列前向き'!C35,\"\")","v":""},{"$f":"IF('7列前向き'!D35<>\"\",'7列前向き'!D35,\"\")","v":""},{"$f":"IF('7列前向き'!E35<>\"\",'7列前向き'!E35,\"\")","v":""},"29.アブドラ\n\n",29]
[30,{"$f":"IF('7列前向き'!B36<>\"\",'7列前向き'!B36,\"\")","v":"アブラハム"},{"$f":"IF('7列前向き'!C36<>\"\",'7列前向き'!C36,\"\")","v":""},{"$f":"IF('7列前向き'!D36<>\"\",'7列前向き'!D36,\"\")","v":""},{"$f":"IF('7列前向き'!E36<>\"\",'7列前向き'!E36,\"\")","v":""},"30.アブラハム\n\n",30]
[31,{"$f":"IF('7列前向き'!B37<>\"\",'7列前向き'!B37,\"\")","v":"アブラム"},{"$f":"IF('7列前向き'!C37<>\"\",'7列前向き'!C37,\"\")","v":""},{"$f":"IF('7列前向き'!D37<>\"\",'7列前向き'!D37,\"\")","v":""},{"$f":"IF('7列前向き'!E37<>\"\",'7列前向き'!E37,\"\")","v":""},"31.アブラム\n\n",31]
[32,{"$f":"IF('7列前向き'!B38<>\"\",'7列前向き'!B38,\"\")","v":"アベル"},{"$f":"IF('7列前向き'!C38<>\"\",'7列前向き'!C38,\"\")","v":""},{"$f":"IF('7列前向き'!D38<>\"\",'7列前向き'!D38,\"\")","v":""},{"$f":"IF('7列前向き'!E38<>\"\",'7列前向き'!E38,\"\")","v":""},"32.アベル\n\n",32,null,null,null,5]
[33,{"$f":"IF('7列前向き'!B39<>\"\",'7列前向き'!B39,\"\")","v":"アマリ"},{"$f":"IF('7列前向き'!C39<>\"\",'7列前向き'!C39,\"\")","v":""},{"$f":"IF('7列前向き'!D39<>\"\",'7列前向き'!D39,\"\")","v":""},{"$f":"IF('7列前向き'!E39<>\"\",'7列前向き'!E39,\"\")","v":""},"33.アマリ\n\n",33]
[34,{"$f":"IF('7列前向き'!B40<>\"\",'7列前向き'!B40,\"\")","v":"アミール"},{"$f":"IF('7列前向き'!C40<>\"\",'7列前向き'!C40,\"\")","v":""},{"$f":"IF('7列前向き'!D40<>\"\",'7列前向き'!D40,\"\")","v":""},{"$f":"IF('7列前向き'!E40<>\"\",'7列前向き'!E40,\"\")","v":""},"34.アミール\n\n",34]
[35,{"$f":"IF('7列前向き'!B41<>\"\",'7列前向き'!B41,\"\")","v":"アモス"},{"$f":"IF('7列前向き'!C41<>\"\",'7列前向き'!C41,\"\")","v":""},{"$f":"IF('7列前向き'!D41<>\"\",'7列前向き'!D41,\"\")","v":""},{"$f":"IF('7列前向き'!E41<>\"\",'7列前向き'!E41,\"\")","v":""},"35.アモス\n\n",35]
[36,{"$f":"IF('7列前向き'!B42<>\"\",'7列前向き'!B42,\"\")","v":"アラン"},{"$f":"IF('7列前向き'!C42<>\"\",'7列前向き'!C42,\"\")","v":""},{"$f":"IF('7列前向き'!D42<>\"\",'7列前向き'!D42,\"\")","v":""},{"$f":"IF('7列前向き'!E42<>\"\",'7列前向き'!E42,\"\")","v":""},"36.アラン\n\n",36]
[37,{"$f":"IF('7列前向き'!B43<>\"\",'7列前向き'!B43,\"\")","v":"アラン"},{"$f":"IF('7列前向き'!C43<>\"\",'7列前向き'!C43,\"\")","v":""},{"$f":"IF('7列前向き'!D43<>\"\",'7列前向き'!D43,\"\")","v":""},{"$f":"IF('7列前向き'!E43<>\"\",'7列前向き'!E43,\"\")","v":""},"37.アラン\n\n",37]
[38,{"$f":"IF('7列前向き'!B44<>\"\",'7列前向き'!B44,\"\")","v":"アリ"},{"$f":"IF('7列前向き'!C44<>\"\",'7列前向き'!C44,\"\")","v":""},{"$f":"IF('7列前向き'!D44<>\"\",'7列前向き'!D44,\"\")","v":""},{"$f":"IF('7列前向き'!E44<>\"\",'7列前向き'!E44,\"\")","v":""},"38.アリ\n\n",38]
[39,{"$f":"IF('7列前向き'!B45<>\"\",'7列前向き'!B45,\"\")","v":"アリ"},{"$f":"IF('7列前向き'!C45<>\"\",'7列前向き'!C45,\"\")","v":""},{"$f":"IF('7列前向き'!D45<>\"\",'7列前向き'!D45,\"\")","v":""},{"$f":"IF('7列前向き'!E45<>\"\",'7列前向き'!E45,\"\")","v":""},"39.アリ\n\n",39,null,null,null,6]
[40,{"$f":"IF('7列前向き'!B46<>\"\",'7列前向き'!B46,\"\")","v":"アリエル"},{"$f":"IF('7列前向き'!C46<>\"\",'7列前向き'!C46,\"\")","v":""},{"$f":"IF('7列前向き'!D46<>\"\",'7列前向き'!D46,\"\")","v":""},{"$f":"IF('7列前向き'!E46<>\"\",'7列前向き'!E46,\"\")","v":""},"40.アリエル\n\n",40]
[41,{"$f":"IF('7列前向き'!B47<>\"\",'7列前向き'!B47,\"\")","v":"アルヴァロ"},{"$f":"IF('7列前向き'!C47<>\"\",'7列前向き'!C47,\"\")","v":""},{"$f":"IF('7列前向き'!D47<>\"\",'7列前向き'!D47,\"\")","v":""},{"$f":"IF('7列前向き'!E47<>\"\",'7列前向き'!E47,\"\")","v":""},"41.アルヴァロ\n\n",41]
[42,{"$f":"IF('7列前向き'!B48<>\"\",'7列前向き'!B48,\"\")","v":"アルヴィン"},{"$f":"IF('7列前向き'!C48<>\"\",'7列前向き'!C48,\"\")","v":""},{"$f":"IF('7列前向き'!D48<>\"\",'7列前向き'!D48,\"\")","v":""},{"$f":"IF('7列前向き'!E48<>\"\",'7列前向き'!E48,\"\")","v":""},"42.アルヴィン\n\n",42]
[43,{"$f":"IF('7列前向き'!B49<>\"\",'7列前向き'!B49,\"\")","v":"アルデン"},{"$f":"IF('7列前向き'!C49<>\"\",'7列前向き'!C49,\"\")","v":""},{"$f":"IF('7列前向き'!D49<>\"\",'7列前向き'!D49,\"\")","v":""},{"$f":"IF('7列前向き'!E49<>\"\",'7列前向き'!E49,\"\")","v":""},"43.アルデン\n\n",43]
[44,{"$f":"IF('7列前向き'!B50<>\"\",'7列前向き'!B50,\"\")","v":"アルド"},{"$f":"IF('7列前向き'!C50<>\"\",'7列前向き'!C50,\"\")","v":""},{"$f":"IF('7列前向き'!D50<>\"\",'7列前向き'!D50,\"\")","v":""},{"$f":"IF('7列前向き'!E50<>\"\",'7列前向き'!E50,\"\")","v":""},"44.アルド\n\n",44]
[45,{"$f":"IF('7列前向き'!B51<>\"\",'7列前向き'!B51,\"\")","v":"アルトゥーロ"},{"$f":"IF('7列前向き'!C51<>\"\",'7列前向き'!C51,\"\")","v":""},{"$f":"IF('7列前向き'!D51<>\"\",'7列前向き'!D51,\"\")","v":""},{"$f":"IF('7列前向き'!E51<>\"\",'7列前向き'!E51,\"\")","v":""},"45.アルトゥーロ\n\n",45]
[46,{"$f":"IF('7列前向き'!B52<>\"\",'7列前向き'!B52,\"\")","v":"アルバート"},{"$f":"IF('7列前向き'!C52<>\"\",'7列前向き'!C52,\"\")","v":""},{"$f":"IF('7列前向き'!D52<>\"\",'7列前向き'!D52,\"\")","v":""},{"$f":"IF('7列前向き'!E52<>\"\",'7列前向き'!E52,\"\")","v":""},"46.アルバート\n\n",46,null,null,null,7]
[47,{"$f":"IF('7列前向き'!B53<>\"\",'7列前向き'!B53,\"\")","v":"ジャック"},{"$f":"IF('7列前向き'!C53<>\"\",'7列前向き'!C53,\"\")","v":"男"},{"$f":"IF('7列前向き'!D53<>\"\",'7列前向き'!D53,\"\")","v":""},{"$f":"IF('7列前向き'!E53<>\"\",'7列前向き'!E53,\"\")","v":""},"47.ジャック\n\n",47]
[48,{"$f":"IF('7列前向き'!B54<>\"\",'7列前向き'!B54,\"\")","v":"メルケル"},{"$f":"IF('7列前向き'!C54<>\"\",'7列前向き'!C54,\"\")","v":""},{"$f":"IF('7列前向き'!D54<>\"\",'7列前向き'!D54,\"\")","v":""},{"$f":"IF('7列前向き'!E54<>\"\",'7列前向き'!E54,\"\")","v":""},"48.メルケル\n\n",48]
[49,{"$f":"IF('7列前向き'!B55<>\"\",'7列前向き'!B55,\"\")","v":"ジョンソン"},{"$f":"IF('7列前向き'!C55<>\"\",'7列前向き'!C55,\"\")","v":""},{"$f":"IF('7列前向き'!D55<>\"\",'7列前向き'!D55,\"\")","v":""},{"$f":"IF('7列前向き'!E55<>\"\",'7列前向き'!E55,\"\")","v":""},"49.ジョンソン\n\n",49,null,null,null,null,43,36,28,22,15,8,1]
[null,null,null,null,null,null,null,null,null,null,null,49,42,35,27,21,14,7]